Reaction Details
TargetSerine/threonine-protein kinase haspin
LigandBDBM350180
Substrate/Competitorn/a
Meas. Tech.Haspin Kinase Assay
IC50 53.3±n/a nM
Citation Pastor Fernández, JMartínez González, SBlanco-Aparicio, CHernández Higueras, AIGómez De La Oliva, CARivero Buceta, VRiesco Fagundo, RC Condensed tricyclic compounds as protein kinase inhibitors US Patent US10208056 Publication Date 2/19/2019
 
Serine/threonine-protein kinase haspin
Name:Serine/threonine-protein kinase haspin
Type:PROTEIN
Mol. Mass.:88531.28
Organism:Homo sapiens (Human)
Description:ChEMBL_1510616
Residue:798
BDBM350180
NameBDBM350180
Synonyms:US10208056, Compound 12
TypeSmall organic molecule
Emp. Form.C15H16N4O2
Mol. Mass.284.3131
SMILESNC(=O)c1cc2c([nH]1)-c1ccncc1OC21CCNCC1