Reaction Details
TargetSerine/threonine-protein kinase haspin
LigandBDBM350196
Substrate/Competitorn/a
Meas. Tech.Haspin Kinase Assay
IC50 26.6±n/a nM
Citation Pastor Fernández, JMartínez González, SBlanco-Aparicio, CHernández Higueras, AIGómez De La Oliva, CARivero Buceta, VRiesco Fagundo, RC Condensed tricyclic compounds as protein kinase inhibitors US Patent US10208056 Publication Date 2/19/2019
 
Serine/threonine-protein kinase haspin
Name:Serine/threonine-protein kinase haspin
Type:PROTEIN
Mol. Mass.:88531.28
Organism:Homo sapiens (Human)
Description:ChEMBL_1510616
Residue:798
BDBM350196
NameBDBM350196
Synonyms:US10208056, Compound 28
TypeSmall organic molecule
Emp. Form.C13H12ClN3O2
Mol. Mass.277.706
SMILESCC1(C)Oc2cnccc2-c2[nH]c(C(N)=O)c(Cl)c12