Reaction Details
TargetSerine/threonine-protein kinase haspin
LigandBDBM350213
Substrate/Competitorn/a
Meas. Tech.Haspin Kinase Assay
IC50 182±n/a nM
Citation Pastor Fernández, JMartínez González, SBlanco-Aparicio, CHernández Higueras, AIGómez De La Oliva, CARivero Buceta, VRiesco Fagundo, RC Condensed tricyclic compounds as protein kinase inhibitors US Patent US10208056 Publication Date 2/19/2019
 
Serine/threonine-protein kinase haspin
Name:Serine/threonine-protein kinase haspin
Type:PROTEIN
Mol. Mass.:88531.28
Organism:Homo sapiens (Human)
Description:ChEMBL_1510616
Residue:798
BDBM350213
NameBDBM350213
Synonyms:US10208056, Compound 45
TypeSmall organic molecule
Emp. Form.C16H19N3O3
Mol. Mass.301.3404
SMILESCOCCn1c(cc2c1-c1ccncc1OC2(C)C)C(N)=O