Reaction Details
TargetSerine/threonine-protein kinase haspin
LigandBDBM350225
Substrate/Competitorn/a
Meas. Tech.Haspin Kinase Assay
IC50 146±n/a nM
Citation Pastor Fernández, JMartínez González, SBlanco-Aparicio, CHernández Higueras, AIGómez De La Oliva, CARivero Buceta, VRiesco Fagundo, RC Condensed tricyclic compounds as protein kinase inhibitors US Patent US10208056 Publication Date 2/19/2019
 
Serine/threonine-protein kinase haspin
Name:Serine/threonine-protein kinase haspin
Type:PROTEIN
Mol. Mass.:88531.28
Organism:Homo sapiens (Human)
Description:ChEMBL_1510616
Residue:798
BDBM350225
NameBDBM350225
Synonyms:US10208056, Compound 55
TypeSmall organic molecule
Emp. Form.C18H19N3O3
Mol. Mass.325.3618
SMILESCC1(C)Oc2cnccc2-c2[nH]c(C(N)=O)c(c12)C1=CCOCC1