Reaction Details
TargetSerine/threonine-protein kinase haspin
LigandBDBM350239
Substrate/Competitorn/a
Meas. Tech.Haspin Kinase Assay
IC50 26.2±n/a nM
Citation Pastor Fernández, JMartínez González, SBlanco-Aparicio, CHernández Higueras, AIGómez De La Oliva, CARivero Buceta, VRiesco Fagundo, RC Condensed tricyclic compounds as protein kinase inhibitors US Patent US10208056 Publication Date 2/19/2019
 
Serine/threonine-protein kinase haspin
Name:Serine/threonine-protein kinase haspin
Type:PROTEIN
Mol. Mass.:88531.28
Organism:Homo sapiens (Human)
Description:ChEMBL_1510616
Residue:798
BDBM350239
NameBDBM350239
Synonyms:US10208056, Compound 66
TypeSmall organic molecule
Emp. Form.C16H17N3O2
Mol. Mass.283.3251
SMILESCCn1c(cc2c1-c1ccncc1OC21CCC1)C(N)=O