Reaction Details
TargetSerine/threonine-protein kinase haspin
LigandBDBM350242
Substrate/Competitorn/a
Meas. Tech.Haspin Kinase Assay
IC50 5150±n/a nM
Citation Pastor Fernández, JMartínez González, SBlanco-Aparicio, CHernández Higueras, AIGómez De La Oliva, CARivero Buceta, VRiesco Fagundo, RC Condensed tricyclic compounds as protein kinase inhibitors US Patent US10208056 Publication Date 2/19/2019
 
Serine/threonine-protein kinase haspin
Name:Serine/threonine-protein kinase haspin
Type:PROTEIN
Mol. Mass.:88531.28
Organism:Homo sapiens (Human)
Description:ChEMBL_1510616
Residue:798
BDBM350242
NameBDBM350242
Synonyms:US10208056, Compound 69
TypeSmall organic molecule
Emp. Form.C17H19N3O2
Mol. Mass.297.3517
SMILESNC(=O)c1cc2[C@H](Oc3cnccc3-c2[nH]1)C1CCCCC1