Reaction Details
TargetSerine/threonine-protein kinase haspin
LigandBDBM350249
Substrate/Competitorn/a
Meas. Tech.Haspin Kinase Assay
IC50 24.2±n/a nM
Citation Pastor Fernández, JMartínez González, SBlanco-Aparicio, CHernández Higueras, AIGómez De La Oliva, CARivero Buceta, VRiesco Fagundo, RC Condensed tricyclic compounds as protein kinase inhibitors US Patent US10208056 Publication Date 2/19/2019
 
Serine/threonine-protein kinase haspin
Name:Serine/threonine-protein kinase haspin
Type:PROTEIN
Mol. Mass.:88531.28
Organism:Homo sapiens (Human)
Description:ChEMBL_1510616
Residue:798
BDBM350249
NameBDBM350249
Synonyms:US10208056, Compound 76
TypeSmall organic molecule
Emp. Form.C16H16FN3O2
Mol. Mass.301.3155
SMILESNC(=O)c1cc2c(-c3ccncc3OC22CCC2)n1CCF