Reaction Details
TargetSerine/threonine-protein kinase haspin
LigandBDBM350250
Substrate/Competitorn/a
Meas. Tech.Haspin Kinase Assay
IC50 188±n/a nM
Citation Pastor Fernández, JMartínez González, SBlanco-Aparicio, CHernández Higueras, AIGómez De La Oliva, CARivero Buceta, VRiesco Fagundo, RC Condensed tricyclic compounds as protein kinase inhibitors US Patent US10208056 Publication Date 2/19/2019
 
Serine/threonine-protein kinase haspin
Name:Serine/threonine-protein kinase haspin
Type:PROTEIN
Mol. Mass.:88531.28
Organism:Homo sapiens (Human)
Description:ChEMBL_1510616
Residue:798
BDBM350250
NameBDBM350250
Synonyms:US10208056, Compound 77
TypeSmall organic molecule
Emp. Form.C17H18N4O3
Mol. Mass.326.3498
SMILESCC(=O)N1CCC2(CC1)Oc1cnccc1-c1[nH]c(cc21)C(N)=O