Reaction Details
TargetSerine/threonine-protein kinase haspin
LigandBDBM350255
Substrate/Competitorn/a
Meas. Tech.Haspin Kinase Assay
IC50 12.8±n/a nM
Citation Pastor Fernández, JMartínez González, SBlanco-Aparicio, CHernández Higueras, AIGómez De La Oliva, CARivero Buceta, VRiesco Fagundo, RC Condensed tricyclic compounds as protein kinase inhibitors US Patent US10208056 Publication Date 2/19/2019
 
Serine/threonine-protein kinase haspin
Name:Serine/threonine-protein kinase haspin
Type:PROTEIN
Mol. Mass.:88531.28
Organism:Homo sapiens (Human)
Description:ChEMBL_1510616
Residue:798
BDBM350255
NameBDBM350255
Synonyms:US10208056, Compound 82
TypeSmall organic molecule
Emp. Form.C17H19N3O3
Mol. Mass.313.3511
SMILESCCn1c(cc2c1-c1ccncc1OC21CCOCC1)C(N)=O