Reaction Details
TargetP2X purinoceptor 7
LigandBDBM227806
Substrate/Competitorn/a
Meas. Tech.Radioligand binding assay
Ki 1.30±n/a nM
Citation Ameriks, MKRech, JCSavall, BM Substituted [1,2,4]triazolo[4,3-a]pyrazines as P2X7 modulators US Patent US10047092 Publication Date 8/14/2018
 
P2X purinoceptor 7
Name:P2X purinoceptor 7
Type:Protein
Mol. Mass.:68602.85
Organism:Homo sapiens (Human)
Description:Q99572
Residue:595
BDBM227806
NameBDBM227806
Synonyms:(6S)-7-[2-Chloro-3-(trifluoromethyl)benzyl]-6-ethyl-3-pyrazin-2-yl-6,7-dihydro[1,2,4]triazolo[4,3-a]pyrazin-8(5H)-one US10053463, 71
TypeSmall organic molecule
Emp. Form.C19H16ClF3N6O
Mol. Mass.436.818
SMILESCC[C@H]1Cn2c(nnc2-c2cnccn2)C(=O)N1Cc1cccc(c1Cl)C(F)(F)F