Reaction Details
TargetPhosphatidylinositol 4,5-bisphosphate 3-kinase catalytic subunit delta isoform
LigandBDBM350413
Substrate/Competitorn/a
Meas. Tech.Transcreener KINASE Assay
IC50 4.00±n/a nM
Citation Su, WDai, GZhang, WDeng, W Imidazopyridazine compounds and their use US Patent US10208066 Publication Date 2/19/2019
 
Phosphatidylinositol 4,5-bisphosphate 3-kinase catalytic subunit delta isoform
Name:Phosphatidylinositol 4,5-bisphosphate 3-kinase catalytic subunit delta isoform
Type:Enzyme Subunit
Mol. Mass.:119489.41
Organism:Homo sapiens (Human)
Description:O00329
Residue:1044
BDBM350413
NameBDBM350413
Synonyms:(S)-4-amino-6-((1-(3-chloro-6-(o-tolyl)imidazo[1,2-b]pyridazin-7-yl)ethyl)amino)pyrimidine-5-carbonitrile | US10208066, Compound 31
TypeSmall organic molecule
Emp. Form.C20H17ClN8
Mol. Mass.404.856
SMILESC[C@H](Nc1ncnc(N)c1C#N)c1cc2ncc(Cl)n2nc1-c1ccccc1C