Reaction Details
TargetDihydroorotate dehydrogenase (quinone), mitochondrial
LigandBDBM16099
Substrate/CompetitorBDBM16100
Meas. Tech.DHODH Inhibition Assay
pH8±n/a
Temperature295.15±n/a K
Ki 2800±400 nM
Km6600±700 nM
kcat15.4±0.2 1/sec
CommentsCompetitive inhibition.
Citation Hurt, DESutton, AEClardy, J Brequinar derivatives and species-specific drug design for dihydroorotate dehydrogenase. Bioorg Med Chem Lett16:1610-5 (2006) 
 
Dihydroorotate dehydrogenase (quinone), mitochondrial
Name:Dihydroorotate dehydrogenase (quinone), mitochondrial
Type:Enzyme
Mol. Mass.:42881.33
Organism:Homo sapiens (Human)
Description:Q02127
Residue:395
BDBM16099
BDBM16100
NameBDBM16099
Synonyms:3-carbamoyl-5-(4-phenylphenyl)benzoic acid AMX02 | Brequinar-derived asymmetric terphenyl compound
TypeSmall organic molecule
Emp. Form.C20H15NO3
Mol. Mass.317.338
SMILESNC(=O)c1cc(cc(c1)-c1ccc(cc1)-c1ccccc1)C(O)=O