Reaction Details
TargetUrokinase-type plasminogen activator
LigandBDBM16151
Substrate/CompetitorBDBM14716
Meas. Tech.Determination of Inhibitor Potency and Selectivity
Ki 27±n/a nM
Citation Fish, PVBarber, CGBrown, DGButt, RCollis, MGDickinson, RPHenry, BTHorne, VAHuggins, JPKing, EO'gara, MMcCleverty, DMcIntosh, FPhillips, CWebster, R Selective Urokinase-Type Plasminogen Activator Inhibitors. 4. 1-(7-Sulfonamidoisoquinolinyl)guanidines. J Med Chem50:2341-51 (2007) 
 
Urokinase-type plasminogen activator
Name:Urokinase-type plasminogen activator
Type:Enzyme
Mol. Mass.:48528.62
Organism:Homo sapiens (Human)
Description:P00749
Residue:431
BDBM16151
BDBM14716
NameBDBM16151
Synonyms:(2S)-2-[benzyl({4-chloro-1-[(diaminomethylidene)amino]isoquinoline-7-})sulfonamido]propanoic acid | substituted glycine deriv. 25
TypeSmall organic molecule
Emp. Form.C20H20ClN5O4S
Mol. Mass.461.922
SMILES[#6]-[#6@H](-[#7](-[#6]-c1ccccc1)S(=O)(=O)c1ccc2c(Cl)cnc(\[#7]=[#6](/[#7])-[#7])c2c1)-[#6](-[#8])=O