Reaction Details
TargetUrokinase-type plasminogen activator
LigandBDBM16160
Substrate/CompetitorBDBM14716
Meas. Tech.Determination of Inhibitor Potency and Selectivity
Ki 111±n/a nM
Citation Fish, PVBarber, CGBrown, DGButt, RCollis, MGDickinson, RPHenry, BTHorne, VAHuggins, JPKing, EO'gara, MMcCleverty, DMcIntosh, FPhillips, CWebster, R Selective Urokinase-Type Plasminogen Activator Inhibitors. 4. 1-(7-Sulfonamidoisoquinolinyl)guanidines. J Med Chem50:2341-51 (2007) 
 
Urokinase-type plasminogen activator
Name:Urokinase-type plasminogen activator
Type:Enzyme
Mol. Mass.:48528.62
Organism:Homo sapiens (Human)
Description:P00749
Residue:431
BDBM16160
BDBM14716
NameBDBM16160
Synonyms:(2S)-1-({4-chloro-1-[(diaminomethylidene)amino]isoquinoline-7-}sulfonyl)pyrrolidine-2-carboxylic acid | cyclic deriv. 34
TypeSmall organic molecule
Emp. Form.C15H16ClN5O4S
Mol. Mass.397.837
SMILES[#7]\[#6](-[#7])=[#7]/c1ncc(Cl)c2ccc(cc12)S(=O)(=O)[#7]-1-[#6]-[#6]-[#6]-[#6@H]-1-[#6](-[#8])=O