Reaction Details
TargetUrokinase-type plasminogen activator
LigandBDBM16167
Substrate/CompetitorBDBM14716
Meas. Tech.Determination of Inhibitor Potency and Selectivity
Ki 67±n/a nM
Citation Fish, PVBarber, CGBrown, DGButt, RCollis, MGDickinson, RPHenry, BTHorne, VAHuggins, JPKing, EO'gara, MMcCleverty, DMcIntosh, FPhillips, CWebster, R Selective Urokinase-Type Plasminogen Activator Inhibitors. 4. 1-(7-Sulfonamidoisoquinolinyl)guanidines. J Med Chem50:2341-51 (2007) 
 
Urokinase-type plasminogen activator
Name:Urokinase-type plasminogen activator
Type:Enzyme
Mol. Mass.:48528.62
Organism:Homo sapiens (Human)
Description:P00749
Residue:431
BDBM16167
BDBM14716
NameBDBM16167
Synonyms:2-(4-chloro-7-{[1-(hydroxymethyl)cyclopentyl]sulfamoyl}isoquinolin-1-yl)guanidine | cycloleucine deriv. 41
TypeSmall organic molecule
Emp. Form.C16H20ClN5O3S
Mol. Mass.397.88
SMILES[#7]\[#6](-[#7])=[#7]/c1ncc(Cl)c2ccc(cc12)S(=O)(=O)[#7]C1([#6]-[#8])[#6]-[#6]-[#6]-[#6]1