Reaction Details
TargetSigma intracellular receptor 2
LigandBDBM349570
Substrate/Competitorn/a
Meas. Tech.Radioligand Binding Assay
Ki 1.30±n/a nM
Citation Rishton, GCatalano, SMLook, GC Isoindoline compositions and methods for treating neurodegenerative disease US Patent US9796672 Publication Date 10/24/2017
 
Sigma intracellular receptor 2
Name:Sigma intracellular receptor 2
Type:Protein
Mol. Mass.:20857.20
Organism:Homo sapiens (Human)
Description:Q5BJF2
Residue:176
BDBM349570
NameBDBM349570
Synonyms:US10207991, Ex. Cpd. No. 88 US11691947, Example 88
TypeSmall organic molecule
Emp. Form.C23H30FNO2
Mol. Mass.371.4882
SMILESCC(C)COc1cc(CCC(C)(C)N2Cc3cccc(F)c3C2)ccc1O