Reaction Details
TargetLysosomal acid glucosylceramidase
LigandBDBM285839
Substrate/Competitorn/a
Meas. Tech.Inhibition Assay
Ki 6.70±n/a nM
Citation Kaul, RMcEachern, EJSun, JVocadlo, DJZhou, YZhu, Y Glucocerebrosidase modulators and uses thereof US Patent US9796680 Publication Date 10/24/2017
 
Lysosomal acid glucosylceramidase
Name:Lysosomal acid glucosylceramidase
Type:Enzyme
Mol. Mass.:59724.64
Organism:Homo sapiens (Human)
Description:The beta-Glu activity was measured with commercially available beta-glucocerebrosidase (Ceredase) as the enzyme source.
Residue:536
BDBM285839
NameBDBM285839
Synonyms:(6R,7R,8S)-8-(prop-1-yn-1-yl)-4-azaspiro[2.5]octane-6,7-diol US9796680, Example 21
TypeSmall organic molecule
Emp. Form.C10H15NO2
Mol. Mass.181.2316
SMILESCC#C[C@@H]1[C@@H](O)[C@H](O)CNC11CC1