Reaction Details
TargetEnoyl-[acyl-carrier-protein] reductase [NADH]
LigandBDBM16300
Substrate/CompetitorBDBM16293
Meas. Tech.Measurement of Inhibition Constants
pH6.8±n/a
Temperature295.15±n/a K
Ki 0.75±0.08 nM
Km29000±n/a nM
CommentsKi for the inhibition of InhA by the INH-NAD adduct was from Rawat et al., Proc. Natl. Acad. Sci. U.S.A. 100, 13881-13886.
Citation Sullivan, TJTruglio, JJBoyne, MENovichenok, PZhang, XStratton, CFLi, HJKaur, TAmin, AJohnson, FSlayden, RAKisker, CTonge, PJ High affinity InhA inhibitors with activity against drug-resistant strains of Mycobacterium tuberculosis. ACS Chem Biol1:43-53 (2006) 
 
Enoyl-[acyl-carrier-protein] reductase [NADH]
Name:Enoyl-[acyl-carrier-protein] reductase [NADH]
Type:Enzyme
Mol. Mass.:28526.00
Organism:Mycobacterium tuberculosis (strain ATCC 25618 / H37Rv)
Description:P9WGR1
Residue:269
BDBM16300
BDBM16293
NameBDBM16300
Synonyms:INH-NAD Adduct [({[(2R,3S,4R,5R)-5-(6-amino-9H-purin-9-yl)-3,4-dihydroxyoxolan-2-yl]methoxy}(hydroxy)phosphoryl)oxy]({[(2R,3S,4R,5R)-5-[(4S)-3-carbamoyl-4-(pyridin-4-ylcarbonyl)-1,4-dihydropyridin-1-yl]-3,4-dihydroxyoxolan-2-yl]methoxy})phosphinic acid | [[(2R,3S,4R,5R)-5-(6-aminopurin-9-yl)-3,4-dihydroxy-oxolan-2-yl]methoxy-hydroxy-phosphoryl]oxy-[[(2R,3S,4R,5R)-5-[(4S)-3-carbamoyl-4-(pyridine-4-carbonyl)-4H-pyridin-1-yl]-3,4-dihydroxy-oxolan-2-yl]methoxy]phosphinic acid
Typen/a
Emp. Form.C27H32N8O15P2
Mol. Mass.770.5351
SMILESNC(=O)C1=CN(C=C[C@@H]1C(=O)c1ccncc1)[C@@H]1O[C@H](CO[P@](O)(=O)O[P@](O)(=O)OC[C@H]2O[C@H]([C@H](O)[C@@H]2O)n2cnc3c(N)ncnc23)[C@@H](O)[C@H]1O