Reaction Details
TargetDihydroorotate dehydrogenase (quinone), mitochondrial
LigandBDBM15339
Substrate/CompetitorBDBM14700
Meas. Tech.Enzyme Inhibition Assay
pH8±n/a
Temperature303.15±n/a K
IC50 367±10 nM
Citation Hansen, MLe Nours, JJohansson, EAntal, TUllrich, ALoffler, MLarsen, S Inhibitor binding in a class 2 dihydroorotate dehydrogenase causes variations in the membrane-associated N-terminal domain. Protein Sci13:1031-42 (2004) 
 
Dihydroorotate dehydrogenase (quinone), mitochondrial
Name:Dihydroorotate dehydrogenase (quinone), mitochondrial
Type:Enzyme
Mol. Mass.:42672.97
Organism:Rattus norvegicus (rat)
Description:The enzyme assay was performed with the histidine-tagged enzyme without cleavage of the tag.
Residue:395
BDBM15339
BDBM14700
NameBDBM15339
Synonyms:6-fluoro-2-[4-(2-fluorophenyl)phenyl]-3-methyl-quinoline-4-carboxylic acid Biphenquinate | Brequinar
TypeSmall organic molecule
Emp. Form.C23H15F2NO2
Mol. Mass.375.3675
SMILESCc1c(nc2ccc(F)cc2c1C(O)=O)-c1ccc(cc1)-c1ccccc1F