Reaction Details
TargetVascular endothelial growth factor receptor 2
LigandBDBM227802
Substrate/Competitorn/a
Meas. Tech.KDR (VEGFR-2) Kinase Assay
pH7±n/a
IC50 0.246±n/a nM
Commentsextracted
Citation Schall, AKlar, JLobell, MSchirok, HTelser, JMüller, SBrohm, DBriem, HJörißen, HKeldenich, JBöttger, MVon Degenfeld, GSchlange, TBömer, ULindner, NEilken, HHristodorov, DWasnaire, PGericke, KMBärfacker, L Substituted pyridobenzodiazepinone-derivatives and use thereof US Patent US10047096 Publication Date 8/14/2018
 
Vascular endothelial growth factor receptor 2
Name:Vascular endothelial growth factor receptor 2
Type:Receptor Tyrosine Kinase
Mol. Mass.:151510.97
Organism:Homo sapiens (Human)
Description:P35968
Residue:1356
BDBM227802
NameBDBM227802
Synonyms:US10047096, 65 | rac-4-[(2-Fluoro-5-hydroxy-4-methylphenyl)amino]-8-[(3-hydroxypyrrolidin-1-yl)methyl]-6,11-dihydro-5H-pyrido[2,3-b][1,5]benzodiazepin-5-one
TypeSmall organic molecule
Emp. Form.C24H24FN5O3
Mol. Mass.449.4775
SMILESCc1cc(F)c(Nc2ccnc3Nc4ccc(CN5CCC(O)C5)cc4NC(=O)c23)cc1O