Reaction Details
TargetPlatelet-derived growth factor receptor beta
LigandBDBM227829
Substrate/Competitorn/a
Meas. Tech.PDGFRbeta Kinase Assay
pH7.5±n/a
Temperature295.15±n/a K
IC50 0.793±n/a nM
Commentsextracted
Citation Schall, AKlar, JLobell, MSchirok, HTelser, JMüller, SBrohm, DBriem, HJörißen, HKeldenich, JBöttger, MVon Degenfeld, GSchlange, TBömer, ULindner, NEilken, HHristodorov, DWasnaire, PGericke, KMBärfacker, L Substituted pyridobenzodiazepinone-derivatives and use thereof US Patent US10047096 Publication Date 8/14/2018
 
Platelet-derived growth factor receptor beta
Name:Platelet-derived growth factor receptor beta
Type:Enzyme
Mol. Mass.:123922.25
Organism:Homo sapiens (Human)
Description:P09619
Residue:1106
BDBM227829
NameBDBM227829
Synonyms:4-[(4-Chloro-2-fluoro-5-hydroxyphenyl)amino]-8-{[ethyl(2-hydroxyethyl)amino]methyl}-6,11-dihydro-5H-pyrido[2,3-b][1,5]benzodiazepin-5-one | US10047096, 90
TypeSmall organic molecule
Emp. Form.C23H23ClFN5O3
Mol. Mass.471.912
SMILESCCN(CCO)Cc1ccc2Nc3nccc(Nc4cc(O)c(Cl)cc4F)c3C(=O)Nc2c1