Reaction Details
TargetProthrombin
LigandBDBM16305
Substrate/CompetitorBDBM12679
Meas. Tech.Enzyme Inhibition Assay
pH8.2±n/a
Temperature295.15±n/a K
Ki 23.1±n/a nM
Citation Katz, BAClark, JMFiner-Moore, JSJenkins, TEJohnson, CRRoss, MJLuong, CMoore, WRStroud, RM Design of potent selective zinc-mediated serine protease inhibitors. Nature391:608-12 (1998) 
 
Prothrombin
Name:Prothrombin
Type:Protein
Mol. Mass.:70029.57
Organism:Homo sapiens (Human)
Description:P00734
Residue:622
BDBM16305
BDBM12679
NameBDBM16305
Synonyms:2-(1H-imidazol-2-ylmethyl)-1H-1,3-benzodiazole-6-carboximidamide APD-3
TypeSmall organic molecule
Emp. Form.C12H12N6
Mol. Mass.240.2639
SMILESNC(=N)c1ccc2nc(Cc3ncc[nH]3)[nH]c2c1