Reaction Details
TargetProthrombin
LigandBDBM16306
Substrate/CompetitorBDBM12679
Meas. Tech.Enzyme Inhibition Assay
pH8.2±n/a
Temperature295.15±n/a K
Ki 721±n/a nM
Citation Katz, BAClark, JMFiner-Moore, JSJenkins, TEJohnson, CRRoss, MJLuong, CMoore, WRStroud, RM Design of potent selective zinc-mediated serine protease inhibitors. Nature391:608-12 (1998) 
 
Prothrombin
Name:Prothrombin
Type:Protein
Mol. Mass.:70029.57
Organism:Homo sapiens (Human)
Description:P00734
Residue:622
BDBM16306
BDBM12679
NameBDBM16306
Synonyms:2-(pyridin-2-yl)-1H-1,3-benzodiazole-6-carboximidamide APD-4 | CHEMBL381148
TypeSmall organic molecule
Emp. Form.C13H11N5
Mol. Mass.237.2599
SMILESNC(=N)c1ccc2nc([nH]c2c1)-c1ccccn1