Reaction Details
TargetProthrombin
LigandBDBM16307
Substrate/CompetitorBDBM12679
Meas. Tech.Enzyme Inhibition Assay
pH8.2±n/a
Temperature295.15±n/a K
Ki 10500±n/a nM
Citation Katz, BAClark, JMFiner-Moore, JSJenkins, TEJohnson, CRRoss, MJLuong, CMoore, WRStroud, RM Design of potent selective zinc-mediated serine protease inhibitors. Nature391:608-12 (1998) 
 
Prothrombin
Name:Prothrombin
Type:Protein
Mol. Mass.:70029.57
Organism:Homo sapiens (Human)
Description:P00734
Residue:622
BDBM16307
BDBM12679
NameBDBM16307
Synonyms:2-(pyridin-2-ylmethyl)-1H-1,3-benzodiazole-6-carboximidamide APD-5 | CHEMBL204126
TypeSmall organic molecule
Emp. Form.C14H13N5
Mol. Mass.251.2865
SMILESNC(=N)c1ccc2nc(Cc3ccccn3)[nH]c2c1