Reaction Details
TargetProthrombin
LigandBDBM16309
Substrate/CompetitorBDBM12679
Meas. Tech.Enzyme Inhibition Assay
pH8.2±n/a
Temperature295.15±n/a K
Ki 321±n/a nM
Citation Katz, BAClark, JMFiner-Moore, JSJenkins, TEJohnson, CRRoss, MJLuong, CMoore, WRStroud, RM Design of potent selective zinc-mediated serine protease inhibitors. Nature391:608-12 (1998) 
 
Prothrombin
Name:Prothrombin
Type:Protein
Mol. Mass.:70029.57
Organism:Homo sapiens (Human)
Description:P00734
Residue:622
BDBM16309
BDBM12679
NameBDBM16309
Synonyms:2-(quinolin-8-yl)-1H-1,3-benzodiazole-6-carboximidamide APD-7
TypeSmall organic molecule
Emp. Form.C17H13N5
Mol. Mass.287.3186
SMILESNC(=N)c1ccc2nc([nH]c2c1)-c1cccc2cccnc12