Reaction Details
TargetAldo-keto reductase family 1 member B1
LigandBDBM16426
Substrate/CompetitorBDBM16418
Meas. Tech.Enzyme Inhibition Assay
pH7±n/a
Temperature298.15±n/a K
Ki 3500±400 nM
Citation Brownlee, JMCarlson, EMilne, ACPape, EHarrison, DH Structural and thermodynamic studies of simple aldose reductase-inhibitor complexes. Bioorg Chem34:424-44 (2006) 
 
Aldo-keto reductase family 1 member B1
Name:Aldo-keto reductase family 1 member B1
Type:Protein
Mol. Mass.:35855.50
Organism:Homo sapiens (Human)
Description:P15121. 4LAU; 2IKI; 4LB4; 2FZD; 2FZ8; 1US0
Residue:316
BDBM16426
BDBM16418
NameBDBM16426
Synonyms:2-(2-hydroxyphenyl)acetic acid Benzeneacetic acid | CHEMBL240714
TypeSmall organic molecule
Emp. Form.C8H8O3
Mol. Mass.152.1473
SMILESOC(=O)Cc1ccccc1O