Reaction Details
TargetAldo-keto reductase family 1 member B1 [W220Y,C299A]
LigandBDBM16428
Substrate/CompetitorBDBM16416
Meas. Tech.Enzyme Inhibition Assay
Ki 12000±n/a nM
Citation Brownlee, JMCarlson, EMilne, ACPape, EHarrison, DH Structural and thermodynamic studies of simple aldose reductase-inhibitor complexes. Bioorg Chem34:424-44 (2006) 
 
Aldo-keto reductase family 1 member B1 [W220Y,C299A]
Name:Aldo-keto reductase family 1 member B1 [W220Y,C299A]
Type:Enzyme
Mol. Mass.:35800.39
Organism:Homo sapiens (Human)
Description:P15121[W220Y,C299A]
Residue:316
BDBM16428
BDBM16416
NameBDBM16428
Synonyms:2,6-Difluorophenylacetic acid EINECS 285-289-3
TypeSmall organic molecule
Emp. Form.C8H6F2O2
Mol. Mass.172.1288
SMILESOC(=O)Cc1c(F)cccc1F