Reaction Details
TargetAldo-keto reductase family 1 member B1
LigandBDBM16312
Substrate/CompetitorBDBM16443
Meas. Tech.In Vitro Aldose Reductase Inhibition Assay
pH7±n/a
Temperature297.15±n/a K
IC50 140±n/a nM
Citation Mylari, BLArmento, SJBeebe, DAConn, ELCoutcher, JBDina, MSO'Gorman, MTLinhares, MCMartin, WHOates, PJTess, DAWithbroe, GJZembrowski, WJ A highly selective, non-hydantoin, non-carboxylic acid inhibitor of aldose reductase with potent oral activity in diabetic rat models: 6-(5-chloro-3-methylbenzofuran- 2-sulfonyl)-2-H-pyridazin-3-one. J Med Chem46:2283-6 (2003) 
 
Aldo-keto reductase family 1 member B1
Name:Aldo-keto reductase family 1 member B1
Type:Protein
Mol. Mass.:35855.50
Organism:Homo sapiens (Human)
Description:P15121. 4LAU; 2IKI; 4LB4; 2FZD; 2FZ8; 1US0
Residue:316
BDBM16312
BDBM16443
NameBDBM16312
Synonyms:(4S)-6-fluoro-2,3-dihydrospiro[1-benzopyran-4,4'-imidazolidine]-2',5'-dione Sorbinil
TypeSmall organic molecule
Emp. Form.C11H9FN2O3
Mol. Mass.236.1992
SMILESFc1ccc2OCC[C@]3(NC(=O)NC3=O)c2c1