Reaction Details
TargetNuclear receptor ROR-gamma
LigandBDBM351642
Substrate/Competitorn/a
Meas. Tech.Binding Assay
Ki<100±n/a nM
Citation Claremon, DADillard, LWDong, CFan, YJia, LLotesta, SDMarcus, ASingh, SBTice, CMYuan, JZhao, WZheng, YZhuang, L Dihydropyrrolopyridine inhibitors of ROR-gamma US Patent US9796710 Publication Date 10/24/2017
 
Nuclear receptor ROR-gamma
Name:Nuclear receptor ROR-gamma
Type:Enzyme Catalytic Domain
Mol. Mass.:58218.40
Organism:Homo sapiens (Human)
Description:P51449
Residue:518
BDBM351642
NameBDBM351642
Synonyms:US9796710, Compound 18
TypeSmall organic molecule
Emp. Form.C28H36F3N3O5S
Mol. Mass.583.663
SMILESCCS(=O)(=O)c1ccc(cc1)[C@H](CO)NC(=O)c1cnc2[C@H](C(C)C)N(C[C@@H]3CC[C@@H](CO3)C(F)(F)F)Cc2c1