Reaction Details
TargetNuclear receptor ROR-gamma
LigandBDBM351643
Substrate/Competitorn/a
Meas. Tech.Binding Assay
Ki<100±n/a nM
Citation Claremon, DADillard, LWDong, CFan, YJia, LLotesta, SDMarcus, ASingh, SBTice, CMYuan, JZhao, WZheng, YZhuang, L Dihydropyrrolopyridine inhibitors of ROR-gamma US Patent US9796710 Publication Date 10/24/2017
 
Nuclear receptor ROR-gamma
Name:Nuclear receptor ROR-gamma
Type:Enzyme Catalytic Domain
Mol. Mass.:58218.40
Organism:Homo sapiens (Human)
Description:P51449
Residue:518
BDBM351643
NameBDBM351643
Synonyms:US9796710, Compound 19
TypeSmall organic molecule
Emp. Form.C27H28F3N3O4S
Mol. Mass.547.589
SMILESCCS(=O)(=O)c1ccc(cc1)[C@H](CO)NC(=O)c1cnc2[C@@H](Cc3ccccc3)N(CC(F)(F)F)Cc2c1