Reaction Details
TargetNuclear receptor ROR-gamma
LigandBDBM351751
Substrate/Competitorn/a
Meas. Tech.Binding Assay
Ki<100±n/a nM
Citation Claremon, DADillard, LWDong, CFan, YJia, LLotesta, SDMarcus, ASingh, SBTice, CMYuan, JZhao, WZheng, YZhuang, L Dihydropyrrolopyridine inhibitors of ROR-gamma US Patent US9796710 Publication Date 10/24/2017
 
Nuclear receptor ROR-gamma
Name:Nuclear receptor ROR-gamma
Type:Enzyme Catalytic Domain
Mol. Mass.:58218.40
Organism:Homo sapiens (Human)
Description:P51449
Residue:518
BDBM351751
NameBDBM351751
Synonyms:US9796710, Compound 44
TypeSmall organic molecule
Emp. Form.C28H37F3N4O4S
Mol. Mass.582.678
SMILESCCS(=O)(=O)c1ccc(nc1)[C@@H](CO)NC(=O)c1cnc2[C@H](C(C)C)N(C[C@H]3CC[C@@H](CC3)C(F)(F)F)Cc2c1