Reaction Details
TargetTyrosine-protein kinase BTK
LigandBDBM351878
Substrate/Competitorn/a
Meas. Tech.Fluorescence Polarization-Based Kinase Assay
Ki<100±n/a nM
Citation Laurent, ARose, YJaquith, JB Selective inhibitors of Tec and Src protein kinase families US Patent US9796716 Publication Date 10/24/2017
 
Tyrosine-protein kinase BTK
Name:Tyrosine-protein kinase BTK
Type:Enzyme
Mol. Mass.:76289.95
Organism:Homo sapiens (Human)
Description:Q06187
Residue:659
BDBM351878
NameBDBM351878
Synonyms:US9796716, Compound 123
TypeSmall organic molecule
Emp. Form.C26H26FN7O2
Mol. Mass.487.5287
SMILESCC(C)n1nc(-c2ccc(Oc3cc(F)cc(OCc4cnc(C)n4C)c3)cc2)c2c(N)ncnc12