Reaction Details
TargetGlucocorticoid receptor
LigandBDBM351897
Substrate/Competitorn/a
Meas. Tech.Binding Assay
Ki 0.660±n/a nM
Citation Yang, MGXiao, ZWeinstein, DS Imidazole-derived modulators of the glucocorticoid receptor US Patent US9796720 Publication Date 10/24/2017
 
Glucocorticoid receptor
Name:Glucocorticoid receptor
Type:Enzyme
Mol. Mass.:85656.87
Organism:Homo sapiens (Human)
Description:P04150
Residue:777
BDBM351897
NameBDBM351897
Synonyms:(S)-5-(2-(1H-Imidazo[4,5-b]pyrazin-2-yl)propan-2-yl)-2-(4-ethoxyphenyl)-9-fluoro-5H-chromeno[2,3-b]pyridine | US9796720, 12
TypeSmall organic molecule
Emp. Form.C28H24FN5O2
Mol. Mass.481.5209
SMILESCCOc1ccc(cc1)-c1ccc2[C@H](c3cccc(F)c3Oc2n1)C(C)(C)c1nc2nccnc2[nH]1