Reaction Details
TargetCathepsin B
LigandBDBM16505
Substrate/CompetitorBDBM16498
Meas. Tech.Inhibitory Activity Measurement of Bovine Cathepsin B.
pH6±n/a
Temperature313.15±n/a K
IC50 46000±n/a nM
CommentsThe second order rate constant, k2 =310 M-1s-1.
Citation Watanabe, DYamamoto, ATomoo, KMatsumoto, KMurata, MKitamura, KIshida, T Quantitative evaluation of each catalytic subsite of cathepsin B for inhibitory activity based on inhibitory activity-binding mode relationship of epoxysuccinyl inhibitors by X-ray crystal structure analyses of complexes. J Mol Biol362:979-93 (2006) 
 
Cathepsin B
Name:Cathepsin B
Type:Enzyme
Mol. Mass.:36657.87
Organism:Bos taurus (bovine)
Description:Bovine spleen CB was purchased from Sigma Co. (USA).
Residue:335
BDBM16505
BDBM16498
NameBDBM16505
Synonyms:BzlNH-tES-Ile-Pro-OBzl CA077 benzyl N-{[(2S,3S)-3-(benzylcarbamoyl)oxiran-2-yl]carbonyl}-L-isoleucyl-L-prolinate | epoxysuccinyl derivative 8
TypeSmall organic molecule
Emp. Form.C29H35N3O6
Mol. Mass.521.6047
SMILES[H][C@@]1(O[C@]1([H])C(=O)N[C@@H]([C@@H](C)CC)C(=O)N1CCC[C@H]1C(=O)OCc1ccccc1)C(=O)NCc1ccccc1