Reaction Details
TargetCathepsin B
LigandBDBM16509
Substrate/CompetitorBDBM16498
Meas. Tech.Inhibitory Activity Measurement of Bovine Cathepsin B.
pH6±n/a
Temperature313.15±n/a K
IC50 38±n/a nM
CommentsThe second order rate constant, k2 =112000 M-1s-1.
Citation Watanabe, DYamamoto, ATomoo, KMatsumoto, KMurata, MKitamura, KIshida, T Quantitative evaluation of each catalytic subsite of cathepsin B for inhibitory activity based on inhibitory activity-binding mode relationship of epoxysuccinyl inhibitors by X-ray crystal structure analyses of complexes. J Mol Biol362:979-93 (2006) 
 
Cathepsin B
Name:Cathepsin B
Type:Enzyme
Mol. Mass.:36657.87
Organism:Bos taurus (bovine)
Description:Bovine spleen CB was purchased from Sigma Co. (USA).
Residue:335
BDBM16509
BDBM16498
NameBDBM16509
Synonyms:(2S)-1-[(2S,3S)-3-methyl-2-{[(2S,3S)-3-(propylcarbamoyl)oxiran-2-yl]formamido}pentanoyl]pyrrolidine-2-carboxylic acid CHEMBL490920 PrNH-tES-Ile-Pro-OH | epoxysuccinyl derivative CA074
TypeSmall organic molecule
Emp. Form.C18H29N3O6
Mol. Mass.383.4394
SMILES[H][C@@]1(O[C@]1([H])C(=O)N[C@@H]([C@@H](C)CC)C(=O)N1CCC[C@H]1C(O)=O)C(=O)NCCC