Reaction Details
TargetBeta-secretase 1
LigandBDBM227970
Substrate/Competitorn/a
Meas. Tech.BACE1 HTRF FRET Assay
pH5±n/a
Ki 1.000±n/a nM
Commentsextracted
Citation Dai, XCumming, JNLiu, HScott, JD C5-C6-oxacyclic fused iminopyrimidinone compounds as bace inhibitors, compositions, and their use US Patent US10047098 Publication Date 8/14/2018
 
Beta-secretase 1
Name:Beta-secretase 1
Type:Protein
Mol. Mass.:55755.10
Organism:Homo sapiens (Human)
Description:P56817
Residue:501
BDBM227970
NameBDBM227970
Synonyms:US10047098, 3
TypeSmall organic molecule
Emp. Form.C21H21F3N4O4
Mol. Mass.450.411
SMILESCOC[C@H]1C[C@H]2C(=O)N(C)C(=N)N[C@]2(CO1)c1cc(Oc2ncccc2F)c(F)cc1F