Reaction Details
TargetHigh affinity nerve growth factor receptor
LigandBDBM127782
Substrate/Competitorn/a
Meas. Tech.Omnia Assay
IC50 0.200±n/a nM
Citation Allen, SAndrews, SWCondroski, KRHaas, JHuang, LJiang, YKercher, TSeo, J Substituted pyrazolo[1,5-a]pyrimidine compounds as Trk kinase inhibitors US Patent US9796724 Publication Date 10/24/2017
 
High affinity nerve growth factor receptor
Name:High affinity nerve growth factor receptor
Type:n/a
Mol. Mass.:87498.18
Organism:Homo sapiens (Human)
Description:P04629
Residue:796
BDBM127782
NameBDBM127782
Synonyms:US10251889, Example 155 US8791123, 155 US9796724, Example 155
TypeSmall organic molecule
Emp. Form.C19H21FN6O3
Mol. Mass.400.4068
SMILESCOc1ncc(F)cc1[C@H]1CCCN1c1ccn2ncc(C(=O)NCCO)c2n1