Reaction Details
TargetAldo-keto reductase family 1 member B1
LigandBDBM16634
Substrate/CompetitorBDBM16443
Meas. Tech.In Vitro Aldose Reductase Inhibition Assay
IC50 5±n/a nM
Citation Mylari, BLArmento, SJBeebe, DAConn, ELCoutcher, JBDina, MSO'Gorman, MTLinhares, MCMartin, WHOates, PJTess, DAWithbroe, GJZembrowski, WJ A novel series of non-carboxylic acid, non-hydantoin inhibitors of aldose reductase with potent oral activity in diabetic rat models: 6-(5-chloro-3-methylbenzofuran-2-sulfonyl)-2H-pyridazin-3-one and congeners. J Med Chem48:6326-39 (2005) 
 
Aldo-keto reductase family 1 member B1
Name:Aldo-keto reductase family 1 member B1
Type:Protein
Mol. Mass.:35855.50
Organism:Homo sapiens (Human)
Description:P15121. 4LAU; 2IKI; 4LB4; 2FZD; 2FZ8; 1US0
Residue:316
BDBM16634
BDBM16443
NameBDBM16634
Synonyms:6-{[3-methyl-5-(trifluoromethyl)-1-benzofuran-2-]sulfonyl}-2,3-dihydropyridazin-3-one | Heterocyclic Sulfonylpyridazinone, 19p
TypeSmall organic molecule
Emp. Form.C14H9F3N2O4S
Mol. Mass.358.292
SMILESCc1c(oc2ccc(cc12)C(F)(F)F)S(=O)(=O)c1ccc(=O)[nH]n1