Reaction Details
TargetProteinase-activated receptor 4
LigandBDBM175970
Substrate/Competitorn/a
Meas. Tech. PAR4 FLIPR assay
Temperature298.15±n/a K
EC50 0.320±n/a nM
Commentsextracted
Citation Banville, JRemillard, RRuediger, EHDeon, DHGagnon, MDube, LGuy, JPriestley, ESPosy, SLMaxwell, BDWong, PCLawrence, RMMiller, MM Imidazothiadiazole and imidazopyrazine derivatives as protease activated receptor 4 (PAR4) inhibitors for treating platelet aggregation US Patent US10047103 Publication Date 8/14/2018
 
Proteinase-activated receptor 4
Name:Proteinase-activated receptor 4
Type:Protein
Mol. Mass.:41145.16
Organism:Homo sapiens (Human)
Description:Q96RI0
Residue:385
BDBM175970
NameBDBM175970
Synonyms:US10047103, 3 US9688695, 3
TypeSmall organic molecule
Emp. Form.C24H18N4O4S2
Mol. Mass.490.554
SMILESCOc1nn2cc(nc2s1)-c1cc2c(OCc3csc(n3)-c3ccccc3)cc(OC)cc2o1