Reaction Details
TargetProteinase-activated receptor 4
LigandBDBM176194
Substrate/Competitorn/a
Meas. Tech. PAR4 FLIPR assay
Temperature298.15±n/a K
EC50 0.310±n/a nM
Commentsextracted
Citation Banville, JRemillard, RRuediger, EHDeon, DHGagnon, MDube, LGuy, JPriestley, ESPosy, SLMaxwell, BDWong, PCLawrence, RMMiller, MM Imidazothiadiazole and imidazopyrazine derivatives as protease activated receptor 4 (PAR4) inhibitors for treating platelet aggregation US Patent US10047103 Publication Date 8/14/2018
 
Proteinase-activated receptor 4
Name:Proteinase-activated receptor 4
Type:Protein
Mol. Mass.:41145.16
Organism:Homo sapiens (Human)
Description:Q96RI0
Residue:385
BDBM176194
NameBDBM176194
Synonyms:US10047103, 227 | US9688695, 227
TypeSmall organic molecule
Emp. Form.C26H20FN5O3S
Mol. Mass.501.532
SMILESCOc1cc(OCc2nc(sc2C)-c2ccnc(F)c2)c2cc(oc2c1)-c1cn2nc(C)ccc2n1