Reaction Details
TargetProthrombin
LigandBDBM176041
Substrate/Competitorn/a
Meas. Tech.Platelet Aggregation (PRP) Assay
Temperature298.15±n/a K
IC50 0.960±n/a nM
Commentsextracted
Citation Banville, JRemillard, RRuediger, EHDeon, DHGagnon, MDube, LGuy, JPriestley, ESPosy, SLMaxwell, BDWong, PCLawrence, RMMiller, MM Imidazothiadiazole and imidazopyrazine derivatives as protease activated receptor 4 (PAR4) inhibitors for treating platelet aggregation US Patent US10047103 Publication Date 8/14/2018
 
Prothrombin
Name:Prothrombin
Type:Protein
Mol. Mass.:70029.57
Organism:Homo sapiens (Human)
Description:P00734
Residue:622
BDBM176041
NameBDBM176041
Synonyms:US10047103, 74 | US9688695, 74
TypeSmall organic molecule
Emp. Form.C24H19N5O4S2
Mol. Mass.505.569
SMILESCOc1nn2cc(nc2s1)-c1cc2c(OCc3csc(n3)-c3ccc(C)nc3)cc(OC)cc2o1