Reaction Details
TargetCarbonic anhydrase 1
LigandBDBM11616
Substrate/CompetitorBDBM11326
Meas. Tech.Esterase Assay
Ki 6±n/a nM
Citation Vullo, DFranchi, MGallori, EAntel, JScozzafava, ASupuran, CT Carbonic anhydrase inhibitors. Inhibition of mitochondrial isozyme V with aromatic and heterocyclic sulfonamides. J Med Chem47:1272-9 (2004) 
 
Carbonic anhydrase 1
Name:Carbonic anhydrase 1
Type:Enzyme
Mol. Mass.:28873.37
Organism:Homo sapiens (Human)
Description:P00915
Residue:261
BDBM11616
BDBM11326
NameBDBM11616
Synonyms:5-(4-Acetamido-3-fluorobenzenesulfonamido)-1,3,4-thiadiazole-2-sulfonamide aminobenzolamide 16b | aminobenzolamide deriv. 40
TypeSmall organic molecule
Emp. Form.C10H10FN5O5S3
Mol. Mass.395.41
SMILESCC(=O)Nc1ccc(cc1F)S(=O)(=O)Nc1nnc(s1)S(N)(=O)=O