Reaction Details
TargetCarbonic anhydrase 2
LigandBDBM11634
Substrate/CompetitorBDBM11326
Meas. Tech.Esterase Assay
Ki 1.5±n/a nM
Citation Vullo, DFranchi, MGallori, EAntel, JScozzafava, ASupuran, CT Carbonic anhydrase inhibitors. Inhibition of mitochondrial isozyme V with aromatic and heterocyclic sulfonamides. J Med Chem47:1272-9 (2004) 
 
Carbonic anhydrase 2
Name:Carbonic anhydrase 2
Type:Enzyme
Mol. Mass.:29250.71
Organism:Homo sapiens (Human)
Description:P00918
Residue:260
BDBM11634
BDBM11326
NameBDBM11634
Synonyms:2,3,4,5,6-pentafluoro-N-(3-methyl-5-sulfamoyl-2,3-dihydro-1,3,4-thiadiazol-2-ylidene)benzamide heterocyclic sulfonamide compound 38
TypeSmall organic molecule
Emp. Form.C10H5F5N4O3S2
Mol. Mass.388.294
SMILESCn1nc(sc1=NC(=O)c1c(F)c(F)c(F)c(F)c1F)S(N)(=O)=O