Reaction Details
TargetCarbonic anhydrase 5A, mitochondrial
LigandBDBM16645
Substrate/CompetitorBDBM10856
Meas. Tech.Esterase Assay
Ki 210±n/a nM
Citation Vullo, DFranchi, MGallori, EAntel, JScozzafava, ASupuran, CT Carbonic anhydrase inhibitors. Inhibition of mitochondrial isozyme V with aromatic and heterocyclic sulfonamides. J Med Chem47:1272-9 (2004) 
 
Carbonic anhydrase 5A, mitochondrial
Name:Carbonic anhydrase 5A, mitochondrial
Type:Enzyme
Mol. Mass.:34081.17
Organism:Mus musculus (mouse)
Description:Full length murine, cloned isozyme.
Residue:299
BDBM16645
BDBM10856
NameBDBM16645
Synonyms:4-Propionamido-benzenesulfonamide N-(4-sulfamoylphenyl)propanamide | aromatic sulfonamide compound 10
TypeSmall organic molecule
Emp. Form.C9H12N2O3S
Mol. Mass.228.268
SMILESCCC(=O)Nc1ccc(cc1)S(N)(=O)=O