Reaction Details
TargetCarbonic anhydrase 5A, mitochondrial
LigandBDBM16648
Substrate/CompetitorBDBM10856
Meas. Tech.Esterase Assay
Ki 85±n/a nM
Citation Vullo, DFranchi, MGallori, EAntel, JScozzafava, ASupuran, CT Carbonic anhydrase inhibitors. Inhibition of mitochondrial isozyme V with aromatic and heterocyclic sulfonamides. J Med Chem47:1272-9 (2004) 
 
Carbonic anhydrase 5A, mitochondrial
Name:Carbonic anhydrase 5A, mitochondrial
Type:Enzyme
Mol. Mass.:34081.17
Organism:Mus musculus (mouse)
Description:Full length murine, cloned isozyme.
Residue:299
BDBM16648
BDBM10856
NameBDBM16648
Synonyms:4-n-Pentanamido-benzenesulfonamide N-(4-sulfamoylphenyl)pentanamide | aromatic sulfonamide compound 13
TypeSmall organic molecule
Emp. Form.C11H16N2O3S
Mol. Mass.256.321
SMILESCCCCC(=O)Nc1ccc(cc1)S(N)(=O)=O