Reaction Details
TargetCarbonic anhydrase 5A, mitochondrial
LigandBDBM16654
Substrate/CompetitorBDBM10856
Meas. Tech.Esterase Assay
Ki 21±n/a nM
Citation Vullo, DFranchi, MGallori, EAntel, JScozzafava, ASupuran, CT Carbonic anhydrase inhibitors. Inhibition of mitochondrial isozyme V with aromatic and heterocyclic sulfonamides. J Med Chem47:1272-9 (2004) 
 
Carbonic anhydrase 5A, mitochondrial
Name:Carbonic anhydrase 5A, mitochondrial
Type:Enzyme
Mol. Mass.:34081.17
Organism:Mus musculus (mouse)
Description:Full length murine, cloned isozyme.
Residue:299
BDBM16654
BDBM10856
NameBDBM16654
Synonyms:1-phenyl-3-(4-sulfamoylphenyl)urea | aromatic sulfonamide compound 19
TypeSmall organic molecule
Emp. Form.C13H13N3O3S
Mol. Mass.291.326
SMILESNS(=O)(=O)c1ccc(NC(=O)Nc2ccccc2)cc1