Reaction Details
TargetCarbonic anhydrase 5A, mitochondrial
LigandBDBM16657
Substrate/CompetitorBDBM10856
Meas. Tech.Esterase Assay
Ki 36±n/a nM
Citation Vullo, DFranchi, MGallori, EAntel, JScozzafava, ASupuran, CT Carbonic anhydrase inhibitors. Inhibition of mitochondrial isozyme V with aromatic and heterocyclic sulfonamides. J Med Chem47:1272-9 (2004) 
 
Carbonic anhydrase 5A, mitochondrial
Name:Carbonic anhydrase 5A, mitochondrial
Type:Enzyme
Mol. Mass.:34081.17
Organism:Mus musculus (mouse)
Description:Full length murine, cloned isozyme.
Residue:299
BDBM16657
BDBM10856
NameBDBM16657
Synonyms:1-(3,4-dichlorophenyl)-3-[2-(4-sulfamoylphenyl)ethyl]urea | aromatic sulfonamide compound 22
TypeSmall organic molecule
Emp. Form.C15H15Cl2N3O3S
Mol. Mass.388.269
SMILESNS(=O)(=O)c1ccc(CCNC(=O)Nc2ccc(Cl)c(Cl)c2)cc1