Reaction Details
TargetCarbonic anhydrase 5A, mitochondrial
LigandBDBM16660
Substrate/CompetitorBDBM10856
Meas. Tech.Esterase Assay
Ki 26±n/a nM
Citation Vullo, DFranchi, MGallori, EAntel, JScozzafava, ASupuran, CT Carbonic anhydrase inhibitors. Inhibition of mitochondrial isozyme V with aromatic and heterocyclic sulfonamides. J Med Chem47:1272-9 (2004) 
 
Carbonic anhydrase 5A, mitochondrial
Name:Carbonic anhydrase 5A, mitochondrial
Type:Enzyme
Mol. Mass.:34081.17
Organism:Mus musculus (mouse)
Description:Full length murine, cloned isozyme.
Residue:299
BDBM16660
BDBM10856
NameBDBM16660
Synonyms:4-(2-benzenesulfonamidoethyl)benzene-1-sulfonamide | aromatic sulfonamide compound 25
TypeSmall organic molecule
Emp. Form.C14H16N2O4S2
Mol. Mass.340.418
SMILESNS(=O)(=O)c1ccc(CCNS(=O)(=O)c2ccccc2)cc1