Reaction Details
TargetCarbonic anhydrase 5A, mitochondrial
LigandBDBM16663
Substrate/CompetitorBDBM10856
Meas. Tech.Esterase Assay
Ki 103±n/a nM
Citation Vullo, DFranchi, MGallori, EAntel, JScozzafava, ASupuran, CT Carbonic anhydrase inhibitors. Inhibition of mitochondrial isozyme V with aromatic and heterocyclic sulfonamides. J Med Chem47:1272-9 (2004) 
 
Carbonic anhydrase 5A, mitochondrial
Name:Carbonic anhydrase 5A, mitochondrial
Type:Enzyme
Mol. Mass.:34081.17
Organism:Mus musculus (mouse)
Description:Full length murine, cloned isozyme.
Residue:299
BDBM16663
BDBM10856
NameBDBM16663
Synonyms:N-(4-{[2-(4-sulfamoylphenyl)ethyl]sulfamoyl}phenyl)acetamide | aromatic sulfonamide compound 28
TypeSmall organic molecule
Emp. Form.C16H19N3O5S2
Mol. Mass.397.469
SMILESCC(=O)Nc1ccc(cc1)S(=O)(=O)NCCc1ccc(cc1)S(N)(=O)=O