Reaction Details
TargetCarbonic anhydrase 5A, mitochondrial
LigandBDBM16664
Substrate/CompetitorBDBM10856
Meas. Tech.Esterase Assay
Ki 20±n/a nM
Citation Vullo, DFranchi, MGallori, EAntel, JScozzafava, ASupuran, CT Carbonic anhydrase inhibitors. Inhibition of mitochondrial isozyme V with aromatic and heterocyclic sulfonamides. J Med Chem47:1272-9 (2004) 
 
Carbonic anhydrase 5A, mitochondrial
Name:Carbonic anhydrase 5A, mitochondrial
Type:Enzyme
Mol. Mass.:34081.17
Organism:Mus musculus (mouse)
Description:Full length murine, cloned isozyme.
Residue:299
BDBM16664
BDBM10856
NameBDBM16664
Synonyms:2-oxo-N-(4-sulfamoylphenyl)-2H-chromene-3-carboxamide aromatic sulfonamide compound 29
TypeSmall organic molecule
Emp. Form.C16H12N2O5S
Mol. Mass.344.342
SMILESNS(=O)(=O)c1ccc(NC(=O)c2cc3ccccc3oc2=O)cc1